Target
Seed linoleate 13S-lipoxygenase-1
Ligand
BDBM4375
Substrate
Meas. Tech.
In Vitro LOX Inhibition Assay
Temperature
298.15±n/a K
IC50
6.00e+5±n/a nM
Comments
extracted
Citation
 Litinas, KEMangos, ANikkou, TEHadjipavlou-Litina, DJ Synthesis and biological evaluation of fused oxepinocoumarins as free radicals scavengers. J Enzyme Inhib Med Chem 26:805-12 (2011)  
Target
Name:
Seed linoleate 13S-lipoxygenase-1
Synonyms:
15-LOX 15-lipo-oxygenase (SLO) L-1 LOX1.1 Lipoxygenase (LOX) Lipoxygenase-1 | Seed lipoxygenase-1
Type:
Enzyme
Mol. Mass.:
94365.66
Organism:
Glycine max (soybean)
Description:
Residue:
839
  
Inhibitor
Name:
BDBM4375
Synonyms:
(2E)-3-(3,4-dihydroxyphenyl)prop-2-enoic acid 3,4-Dihydroxycinnamate, XVII Caffeic acid cid_689043
Type:
Small organic molecule
Emp. Form.:
C9H8O4
Mol. Mass.:
180.1574
SMILES:
OC(=O)\C=C\c1ccc(O)c(O)c1
: