Target
Carbonic anhydrase 13
Ligand
BDBM10880
Substrate
Meas. Tech.
CA Activity Assay
pH
7.5±n/a
Ki
21±0.0 nM
Comments
9 mM acetaldehyde extracted
Citation
 Bootorabi, FJänis, JHytönen, VPValjakka, JKuuslahti, MVullo, DNiemelä, OSupuran, CTParkkila, S Acetaldehyde-derived modifications on cytosolic human carbonic anhydrases. J Enzyme Inhib Med Chem 26:862-70 (2011)  
Target
Name:
Carbonic anhydrase 13
Synonyms:
CA13 Carbonic anhydrase Carbonic anhydrase XIII (CA XIII)
Type:
Enzyme
Mol. Mass.:
29445.78
Organism:
Homo sapiens (Human)
Description:
Q8N1Q1
Residue:
262
  
Inhibitor
Name:
BDBM10880
Synonyms:
AZA AZM acetazolamide Acetazolamide Acetazolamide (AZA) Acetazolamide, 5 Acetazolamide, AZA CHEMBL20 Sulfonamide, 1 US11278534, Example acetazolamide sulfonamide 1
Type:
Small organic molecule
Emp. Form.:
C4H6N4O3S2
Mol. Mass.:
222.245
SMILES:
CC(=O)Nc1nnc(s1)S(N)(=O)=O
: