Target
Dual specificity calcium/calmodulin-dependent 3',5'-cyclic nucleotide phosphodiesterase 1B
Ligand
BDBM289570
Substrate
Meas. Tech.
PDE1B Inhibitory Assay
Temperature
298.15±n/a K
IC50
<100±n/a nM
Comments
extracted
Citation
 Branstetter, BBreitenbucher, JDyck, BGomez, LHudson, ARMarrone, TJPeters, MVickers, TWeinhouse, M Therapeutic thiophene-, furan-, and pyridine-fused azolopyrimidin-5-(6h)-ones US Patent  US10105367 Publication Date 10/23/2018 
Target
Name:
Dual specificity calcium/calmodulin-dependent 3',5'-cyclic nucleotide phosphodiesterase 1B
Synonyms:
63 kDa Cam-PDE Calcium/calmodulin-dependent 3',5'-cyclic nucleotide phosphodiesterase 1B PDE1B PDE1B_HUMAN Phosphodiesterase 1B Phosphodiesterase Type 1 (PDE1B) | Phosphodiesterase, PDE1/PDE5
Type:
Enzyme
Mol. Mass.:
61366.51
Organism:
Homo sapiens (Human)
Description:
Residue:
536
  
Inhibitor
Name:
BDBM289570
Synonyms:
(S)-6-(4-Methoxybenzyl)-8-((2-(methoxymethyl)pyrrolidin-1-yl)methyl)-9-methylthieno[3,2-e][1,2,4]triazolo[1,5-c]pyrimidin-5(6H)-one US10376514, Example 58
Type:
Small organic molecule
Emp. Form.:
C23H27N5O3S
Mol. Mass.:
453.557
SMILES:
COC[C@@H]1CCCN1Cc1sc2n(Cc3ccc(OC)cc3)c(=O)n3ncnc3c2c1C
: