Target
N(G),N(G)-dimethylarginine dimethylaminohydrolase 1
Ligand
BDBM152697
Substrate
Meas. Tech.
In Vitro hDDAH-1 Assay
pH
7.4±0
Temperature
310.15±0 K
Ki
1.155e+6± 1.12e+5 nM
Citation
 Kotthaus, JSchade, DKotthaus, JClement, B Designing modulators of dimethylarginine dimethylaminohydrolase (DDAH): a focus on selectivity over arginase. J Enzyme Inhib Med Chem 27:24-8 (2012)  
Target
Name:
N(G),N(G)-dimethylarginine dimethylaminohydrolase 1
Synonyms:
DDAH DDAH1_HUMAN Dimethylarginine dimethylaminohydrolase 1 (DDAH) Dimethylarginine dimethylaminohydrolase 1 (DDAH) L271G Dimethylarginine dimethylaminohydrolase 1 (DDAH1) | N(G),N(G)-dimethylarginine dimethylaminohydrolase 1
Type:
Protein
Mol. Mass.:
31116.90
Organism:
Homo sapiens (Human)
Description:
O94760
Residue:
285
  
Inhibitor
Name:
BDBM152697
Synonyms:
(S)-5-Acetimidamido-2-aminopentanoic acid (4, L-NIO) | hDDAH inhibitor, 1e
Type:
Small organic molecule
Emp. Form.:
C7H15N3O2
Mol. Mass.:
173.2129
SMILES:
CC(=N)NCCC[C@H](N)C(O)=O
: