Target
N(G),N(G)-dimethylarginine dimethylaminohydrolase 1
Ligand
BDBM141899
Substrate
Meas. Tech.
In Vitro hDDAH-1 Assay
pH
7.4±0
Temperature
310.15±0 K
Ki
1.3e+4± 2e+3 nM
Citation
 Kotthaus, JSchade, DKotthaus, JClement, B Designing modulators of dimethylarginine dimethylaminohydrolase (DDAH): a focus on selectivity over arginase. J Enzyme Inhib Med Chem 27:24-8 (2012)  
Target
Name:
N(G),N(G)-dimethylarginine dimethylaminohydrolase 1
Synonyms:
DDAH DDAH1_HUMAN Dimethylarginine dimethylaminohydrolase 1 (DDAH) Dimethylarginine dimethylaminohydrolase 1 (DDAH) L271G Dimethylarginine dimethylaminohydrolase 1 (DDAH1) | N(G),N(G)-dimethylarginine dimethylaminohydrolase 1
Type:
Protein
Mol. Mass.:
31116.90
Organism:
Homo sapiens (Human)
Description:
O94760
Residue:
285
  
Inhibitor
Name:
BDBM141899
Synonyms:
US8921421, L-257 | hDDAH inhibitor, 2a
Type:
Small organic molecule
Emp. Form.:
C9H20N4O3
Mol. Mass.:
232.2801
SMILES:
COCCNC(=N)NCCC[C@H](N)C(O)=O
: