Target
Glutathione reductase, mitochondrial
Ligand
BDBM233150
Substrate
Meas. Tech.
Activity Assay
pH
8±0
Temperature
298.15±0 K
Ki
2.8840e+7± 4.690e+6 nM
IC50
1.38000e+8±n/a nM
Citation
 Karaman, MAkkemik, EBudak, HCiftci, M In vitro effects of some drugs on human erythrocyte glutathione reductase. J Enzyme Inhib Med Chem 27:18-23 (2012)  
Target
Name:
Glutathione reductase, mitochondrial
Synonyms:
GLUR GSHR_HUMAN Glutathione reductase | Glutathione reductase (GR)
Type:
Enzyme
Mol. Mass.:
56271.52
Organism:
Homo sapiens (Human)
Description:
P00390
Residue:
522
  
Inhibitor
Name:
BDBM233150
Synonyms:
Gadopentetic acid
Type:
Small organic molecule
Emp. Form.:
C14H20N3O10
Mol. Mass.:
390.3243
SMILES:
OC(=O)CN(CCN(CCN(CC(O)=O)CC([O-])=O)CC([O-])=O)CC([O-])=O
: