Target
Toll-like receptor 9
Ligand
BDBM235719
Substrate
Meas. Tech.
Antagonism Assay
Temperature
310.15±n/a K
IC50
>10000±n/a nM
Comments
extracted
Citation
 Lipford, GBZepp, CM Immune system modulators US Patent  US9359361 Publication Date 6/7/2016 
Target
Name:
Toll-like receptor 9
Synonyms:
CD_antigen: CD289 TLR9_HUMAN
Type:
Enzyme
Mol. Mass.:
115889.91
Organism:
Homo sapiens (Human)
Description:
Q9NR96
Residue:
1032
  
Inhibitor
Name:
BDBM235719
Synonyms:
US10117875, Example 61 | US9359361, 61
Type:
Small organic molecule
Emp. Form.:
C20H25N9S
Mol. Mass.:
423.538
SMILES:
CN1CCN(CC1)c1cnc2c(NCCSC(N)=N)nc(nc2n1)-c1ccccc1
: