Target
cGMP-specific 3',5'-cyclic phosphodiesterase [537-875]
Ligand
BDBM235742
Substrate
Meas. Tech.
Caliper Mobility-Shift Assay
pH
7.5±n/a
IC50
4.02±n/a nM
Comments
extracted
Citation
 Wu, FWang, A Bicyclic substituted pyrimidine compounds US Patent  US9359371 Publication Date 6/7/2016 
Target
Name:
cGMP-specific 3',5'-cyclic phosphodiesterase [537-875]
Synonyms:
PDE5 PDE5A_HUMAN | Phosphodiesterase 5A
Type:
Enzyme
Mol. Mass.:
39142.81
Organism:
Homo sapiens (Human)
Description:
Recombinant human PDE5A (537-end O76074); Cat no. 93-31G-20 (SignalChem).
Residue:
339
  
Inhibitor
Name:
BDBM235742
Synonyms:
US9359371, 11
Type:
Small organic molecule
Emp. Form.:
C24H30ClN5O3
Mol. Mass.:
471.98
SMILES:
COc1ccc(CNc2nc(ncc2C(=O)N[C@H]2CC[C@H](O)CC2)N2CC3CC3C2)cc1Cl
: