Target
D(1A) dopamine receptor
Ligand
BDBM50387557
Substrate
Meas. Tech.
Reception Binding Assay
Temperature
303.15±n/a K
Ki
28.91±n/a nM
IC50
56.37±n/a nM
Comments
extracted
Citation
 Liu, HXie, XZhen, XSun, HLi, JZhu, LLi, ZChen, YJiang, HChen, K Hexahydrodibenzo[a,g]quinolizine compound, preparation method thereof, pharmaceutical composition and use thereof US Patent  US9359372 Publication Date 6/7/2016 
Target
Name:
D(1A) dopamine receptor
Synonyms:
DA D1 receptor DRD1 Dopamine D1 receptor Dopamine D1A
Type:
Enzyme
Mol. Mass.:
49303.43
Organism:
Homo sapiens (Human)
Description:
P21728
Residue:
446
  
Inhibitor
Name:
BDBM50387557
Synonyms:
CHEMBL2057457 | US9359372, DC037031
Type:
Small organic molecule
Emp. Form.:
C20H23NO2
Mol. Mass.:
309.4021
SMILES:
COc1cc2CCN3Cc4c(C)cc(C)cc4C[C@H]3c2cc1O
: