Target
D(2) dopamine receptor
Ligand
BDBM60961
Substrate
Meas. Tech.
Affinity Assay
Temperature
310.15±n/a K
EC50
15610±n/a nM
Comments
extracted
Citation
 Liu, HXie, XZhen, XSun, HLi, JZhu, LLi, ZChen, YJiang, HChen, K Hexahydrodibenzo[a,g]quinolizine compound, preparation method thereof, pharmaceutical composition and use thereof US Patent  US9359372 Publication Date 6/7/2016 
Target
Name:
D(2) dopamine receptor
Synonyms:
D(2) dopamine receptor DOPAMINE D2 Long DRD2 Dopamine D2 receptor Dopamine D2 receptor (D2R) Dopamine2-like | d2
Type:
Cell-surface receptors
Mol. Mass.:
50647.10
Organism:
Homo sapiens (Human)
Description:
P14416
Residue:
443
  
Inhibitor
Name:
BDBM60961
Synonyms:
US9359372, DC037018
Type:
Emp. Form.:
C21H25NO2
Mol. Mass.:
323.4287
SMILES:
COc1cc2CCN3Cc4c(C)cc(C)cc4CC3c2cc1OC
: