Target
Vascular endothelial growth factor receptor 2
Ligand
BDBM50399332
Substrate
Meas. Tech.
Kinase Inhibition Assay
IC50
373±n/a nM
Citation
 Dannhardt, GPlutizki, SKramb, JMüller, AMöhler, M 3-(indolyl)- or 3-(azaindolyl)- 4-arylmaleimide derivatives for use in the treatment of colon and gastric adenocarcinoma US Patent  US9364459 Publication Date 6/14/2016 
Target
Name:
Vascular endothelial growth factor receptor 2
Synonyms:
CD_antigen=CD309 Fetal liver kinase 1 (FLK-1) KDR Protein-tyrosine kinase receptor Flk-1 VEGFR-2 VEGFR2 Vascular Endothelial Growth Factor Receptor Kinase 2 Vascular endothelial growth factor receptor 2 (KDR) Vascular endothelial growth factor receptor 2 (VEGFR2) Vascular endothelial growth factor receptor-2 (VEGFR-2)
Type:
Receptor Tyrosine Kinase
Mol. Mass.:
151510.97
Organism:
Homo sapiens (Human)
Description:
P35968
Residue:
1356
  
Inhibitor
Name:
BDBM50399332
Synonyms:
CHEMBL2180881 | US9364459, E
Type:
Small organic molecule
Emp. Form.:
C20H17N3O5
Mol. Mass.:
379.3661
SMILES:
COc1cc(cc(OC)c1OC)C1=C(C(=O)NC1=O)c1c[nH]c2cccnc12
: