Target
Receptor-type tyrosine-protein kinase FLT3
Ligand
BDBM50399331
Substrate
Meas. Tech.
Kinase Inhibition Assay
IC50
1902±n/a nM
Citation
 Dannhardt, GPlutizki, SKramb, JMüller, AMöhler, M 3-(indolyl)- or 3-(azaindolyl)- 4-arylmaleimide derivatives for use in the treatment of colon and gastric adenocarcinoma US Patent  US9364459 Publication Date 6/14/2016 
Target
Name:
Receptor-type tyrosine-protein kinase FLT3
Synonyms:
CD135 FL cytokine receptor FLK2 FLT3 Fetal liver kinase-2 Fms-like tyrosine kinase 3 (Flt-3) STK-1 Stem cell tyrosine kinase 1
Type:
Enzyme
Mol. Mass.:
112888.62
Organism:
Homo sapiens (Human)
Description:
P36888
Residue:
993
  
Inhibitor
Name:
BDBM50399331
Synonyms:
CHEMBL2180882 | US9364459, C
Type:
Small organic molecule
Emp. Form.:
C20H17N3O5
Mol. Mass.:
379.3661
SMILES:
COc1cc(cc(OC)c1OC)C1=C(C(=O)NC1=O)c1c[nH]c2cnccc12
: