Target
Genome polyprotein [1027-1711]
Ligand
BDBM235873
Substrate
Meas. Tech.
ELISA-Based Assay
IC50
6.928±n/a nM
Citation
 Dai, XLiu, HPalani, AHe, SNargund, RXiao, DZorn, NDang, QMcComas, CCPeng, XLi, PSoll, R Substituted benzofuran compounds and methods of use thereof for the treatment of viral diseases US Patent  US9364482 Publication Date 6/14/2016 
Target
Name:
Genome polyprotein [1027-1711]
Synonyms:
NS3-NS4A Protease POLG_HCV77
Type:
Mol. Mass.:
72913.15
Organism:
Hepatitis C virus genotype 1a (strain H77) (HCV)
Description:
amino acids 1027 to 1711
Residue:
685
  
Inhibitor
Name:
BDBM235873
Synonyms:
US9364482, 48
Type:
Small organic molecule
Emp. Form.:
C31H24F2N6O5S
Mol. Mass.:
630.621
SMILES:
CNC(=O)c1c(oc2cc(N(C)S(C)(=O)=O)c(cc12)-c1ccc2nnn(Cc3ccc(F)cn3)c(=O)c2c1)-c1ccc(F)cc1
: