Target
Genome polyprotein [1027-1711]
Ligand
BDBM235892
Substrate
Meas. Tech.
ELISA-Based Assay
IC50
11.59±n/a nM
Citation
 Dai, XLiu, HPalani, AHe, SNargund, RXiao, DZorn, NDang, QMcComas, CCPeng, XLi, PSoll, R Substituted benzofuran compounds and methods of use thereof for the treatment of viral diseases US Patent  US9364482 Publication Date 6/14/2016 
Target
Name:
Genome polyprotein [1027-1711]
Synonyms:
NS3-NS4A Protease POLG_HCV77
Type:
Mol. Mass.:
72913.15
Organism:
Hepatitis C virus genotype 1a (strain H77) (HCV)
Description:
amino acids 1027 to 1711
Residue:
685
  
Inhibitor
Name:
BDBM235892
Synonyms:
US9364482, 73
Type:
Small organic molecule
Emp. Form.:
C32H24ClF2N5O5S
Mol. Mass.:
664.078
SMILES:
CNC(=O)c1c(oc2cc(N(C)S(C)(=O)=O)c(cc12)-c1cc2c(cc1Cl)nnn(Cc1ccc(F)cc1)c2=O)-c1ccc(F)cc1
: