Target
Genome polyprotein [1027-1711]
Ligand
BDBM235829
Substrate
Meas. Tech.
ELISA-Based Assay
IC50
2.842±n/a nM
Citation
 Dai, XLiu, HPalani, AHe, SNargund, RXiao, DZorn, NDang, QMcComas, CCPeng, XLi, PSoll, R Substituted benzofuran compounds and methods of use thereof for the treatment of viral diseases US Patent  US9364482 Publication Date 6/14/2016 
Target
Name:
Genome polyprotein [1027-1711]
Synonyms:
NS3-NS4A Protease | POLG_HCVBK
Type:
Enzyme
Mol. Mass.:
73097.29
Organism:
Hepatitis C virus genotype 1b (isolate BK) (HCV)
Description:
amino acids 1027 to 1711
Residue:
685
  
Inhibitor
Name:
BDBM235829
Synonyms:
US9364482, 3
Type:
Small organic molecule
Emp. Form.:
C31H24F2N4O6S
Mol. Mass.:
618.607
SMILES:
CNC(=O)c1c(oc2cc(N(C)S(C)(=O)=O)c(cc12)-c1ccc2OCN(C(=O)c2n1)c1cccc(F)c1)-c1ccc(F)cc1
: