Target
Genome polyprotein [1027-1711]
Ligand
BDBM235858
Substrate
Meas. Tech.
ELISA-Based Assay
IC50
1692±n/a nM
Citation
 Dai, XLiu, HPalani, AHe, SNargund, RXiao, DZorn, NDang, QMcComas, CCPeng, XLi, PSoll, R Substituted benzofuran compounds and methods of use thereof for the treatment of viral diseases US Patent  US9364482 Publication Date 6/14/2016 
Target
Name:
Genome polyprotein [1027-1711]
Synonyms:
NS3-NS4A Protease | POLG_HCVBK
Type:
Enzyme
Mol. Mass.:
73097.29
Organism:
Hepatitis C virus genotype 1b (isolate BK) (HCV)
Description:
amino acids 1027 to 1711
Residue:
685
  
Inhibitor
Name:
BDBM235858
Synonyms:
US9364482, 33
Type:
Small organic molecule
Emp. Form.:
C32H25F2N3O4
Mol. Mass.:
553.5554
SMILES:
CNC(=O)c1c(oc2ccc(cc12)-c1ccc2OCN(C(=O)c2n1)C(C)(C)c1ccc(F)cc1)-c1ccc(F)cc1
: