Target
Genome polyprotein [1027-1711]
Ligand
BDBM235874
Substrate
Meas. Tech.
ELISA-Based Assay
IC50
10.19±n/a nM
Citation
 Dai, XLiu, HPalani, AHe, SNargund, RXiao, DZorn, NDang, QMcComas, CCPeng, XLi, PSoll, R Substituted benzofuran compounds and methods of use thereof for the treatment of viral diseases US Patent  US9364482 Publication Date 6/14/2016 
Target
Name:
Genome polyprotein [1027-1711]
Synonyms:
NS3-NS4A Protease | POLG_HCVBK
Type:
Enzyme
Mol. Mass.:
73097.29
Organism:
Hepatitis C virus genotype 1b (isolate BK) (HCV)
Description:
amino acids 1027 to 1711
Residue:
685
  
Inhibitor
Name:
BDBM235874
Synonyms:
US9364482, 49
Type:
Small organic molecule
Emp. Form.:
C33H27FN4O5S
Mol. Mass.:
610.655
SMILES:
CNC(=O)c1c(oc2cc(N(C)S(C)(=O)=O)c(cc12)-c1ccc2ncn(Cc3ccccc3)c(=O)c2c1)-c1ccc(F)cc1
: