Target
Gamma-aminobutyric acid receptor subunit alpha-4
Ligand
BDBM235908
Substrate
Meas. Tech.
[35S]-TBPS Displacement Assay
IC50
3630±800 nM
Citation
 Covey, D Neuroactive substituted cyclopenta[b]phenanthrenes as modulators for GABA type-A receptors US Patent  US9365502 Publication Date 6/14/2016 
Target
Name:
Gamma-aminobutyric acid receptor subunit alpha-4
Synonyms:
GBRA4_RAT Gamma-aminobutyric acid receptor (GABA(A)) subunit alpha-4
Type:
Enzyme
Mol. Mass.:
60972.37
Organism:
Rattus norvegicus (Rat)
Description:
P28471
Residue:
552
  
Inhibitor
Name:
BDBM235908
Synonyms:
US9365502, MQ-53
Type:
Small organic molecule
Emp. Form.:
C20H32O2
Mol. Mass.:
304.4669
SMILES:
[H][C@]12CC[C@]3(CO3)[C@]1(C)C[C@]1([H])CC[C@@]3([H])C[C@H](O)CC[C@@]3(C)[C@@]1([H])C2
: