Target
Stromelysin-1
Ligand
BDBM113592
Substrate
Meas. Tech.
Inhibition Assay
IC50
1878±n/a nM
Citation
 Clary, LChambon, SChantalat, LRosignoli, CRoye, OPascal, JSchuppli-Nollet, M Benzenesulfonamide compounds, method for synthesizing same, and use thereof in medicine as well as in cosmetics US Patent  US9365529 Publication Date 6/14/2016 
Target
Name:
Stromelysin-1
Synonyms:
MMP-3 MMP3_HUMAN Matrix metalloproteinase 3 Matrix metalloproteinase-3 (MMP-3) SL-1 Stromelysin 1 | Transin-1
Type:
Enzyme
Mol. Mass.:
53973.13
Organism:
Homo sapiens (Human)
Description:
P08254
Residue:
477
  
Inhibitor
Name:
BDBM113592
Synonyms:
US8633196, 24 | US9365529, 24
Type:
Small organic molecule
Emp. Form.:
C28H37N5O7S2
Mol. Mass.:
619.753
SMILES:
CC(C)CS(=O)(=O)N1CCN(CC1)[C@@H](CNS(=O)(=O)c1ccc(OCc2cc(C)nc3ccccc23)cc1)C(=O)NO
: