Target
Disintegrin and metalloproteinase domain-containing protein 10
Ligand
BDBM113591
Substrate
Meas. Tech.
Inhibition Assay
IC50
>10000±n/a nM
Citation
 Clary, LChambon, SChantalat, LRosignoli, CRoye, OPascal, JSchuppli-Nollet, M Benzenesulfonamide compounds, method for synthesizing same, and use thereof in medicine as well as in cosmetics US Patent  US9365529 Publication Date 6/14/2016 
Target
Name:
Disintegrin and metalloproteinase domain-containing protein 10
Synonyms:
ADA10_HUMAN Disintegrin and metalloproteinase domain-containing protein 10 (ADAM10) MADM
Type:
Enzyme
Mol. Mass.:
84160.93
Organism:
Homo sapiens (Human)
Description:
O14672
Residue:
748
  
Inhibitor
Name:
BDBM113591
Synonyms:
US8633196, 23 | US9365529, 23
Type:
Small organic molecule
Emp. Form.:
C28H35N5O6S
Mol. Mass.:
569.672
SMILES:
CC(C)C(=O)N1CCN(CC1)[C@@H](CNS(=O)(=O)c1ccc(OCc2cc(C)nc3ccccc23)cc1)C(=O)NO
: