Target
Cannabinoid receptor 2
Ligand
BDBM235934
Substrate
Meas. Tech.
Competition Binding Assay
pH
7.4±n/a
Temperature
303.15±n/a K
Ki
56.8±n/a nM
Comments
extracted
Citation
 Mechoulam, RMagid, LShohami, EBab, I Arylated camphenes, processes for their preparation and uses thereof US Patent  US9365534 Publication Date 6/14/2016 
Target
Name:
Cannabinoid receptor 2
Synonyms:
CANNABINOID CB2 CB2 CB2B CNR2_HUMAN Cannabinoid CB2 receptor Cannabinoid receptor 2 (CB2R) | hCB2
Type:
G Protein-Coupled Receptor (GPCR)
Mol. Mass.:
39690.94
Organism:
Homo sapiens (Human)
Description:
P34972
Residue:
360
  
Inhibitor
Name:
BDBM235934
Synonyms:
US9365534, HU-909
Type:
Small Organic Molecule
Emp. Form.:
C27H42O3
Mol. Mass.:
414.6206
SMILES:
CCCCCCC(C)(C)c1cc(OC)c(C2=C[C@@H]3CC[C@@]2(CO)C3(C)C)c(OC)c1
: