Target
Cannabinoid receptor 2
Ligand
BDBM235949
Substrate
Meas. Tech.
Competition Binding Assay
pH
7.4±n/a
Temperature
303.15±n/a K
Ki
>10000±n/a nM
Comments
extracted
Citation
 Mechoulam, RMagid, LShohami, EBab, I Arylated camphenes, processes for their preparation and uses thereof US Patent  US9365534 Publication Date 6/14/2016 
Target
Name:
Cannabinoid receptor 2
Synonyms:
CANNABINOID CB2 CB2 CB2B CNR2_HUMAN Cannabinoid CB2 receptor Cannabinoid receptor 2 (CB2R) | hCB2
Type:
G Protein-Coupled Receptor (GPCR)
Mol. Mass.:
39690.94
Organism:
Homo sapiens (Human)
Description:
P34972
Residue:
360
  
Inhibitor
Name:
BDBM235949
Synonyms:
US9365534, HU-974
Type:
Small Organic Molecule
Emp. Form.:
C23H32O4
Mol. Mass.:
372.4978
SMILES:
CCCCCc1cc(OC)c(C2=C[C@H]3CC[C@]2(C(O)=O)C3(C)C)c(OC)c1
: