Target
Isoform PDE10A2 of cAMP and cAMP-inhibited cGMP 3',5'-cyclic phosphodiesterase 10A (PDE10A2)
Ligand
BDBM236052
Substrate
Meas. Tech.
Fluorescence Polarization Assay
pH
7.2±n/a
Temperature
298.15±n/a K
Ki
15±n/a nM
Comments
extracted
Citation
 Cox, CDBeshore, DCKim, JJKuduk, SDMcVean, CAReger, TSheen, JT 1,3 substituted azetidine PDE10 inhibitors US Patent  US9365562 Publication Date 6/14/2016 
Target
Name:
Isoform PDE10A2 of cAMP and cAMP-inhibited cGMP 3',5'-cyclic phosphodiesterase 10A (PDE10A2)
Synonyms:
PDE10A Phosphodiesterase 10A Phosphodiesterase 10A2 cAMP and cAMP-inhibited cGMP 3',5'-cyclic phosphodiesterase 10A (PDE10A2)
Type:
Enzyme
Mol. Mass.:
89387.03
Organism:
Homo sapiens (Human)
Description:
Q9Y233-2
Residue:
789
  
Inhibitor
Name:
BDBM236052
Synonyms:
US9365562, 90
Type:
Small organic molecule
Emp. Form.:
C22H20FN5
Mol. Mass.:
373.4261
SMILES:
Cc1nc(cc(n1)-c1ccccc1F)N1CC(C1)c1nc2ccccc2n1C
: