Target
Transient receptor potential cation channel subfamily V member 1
Ligand
BDBM236090
Substrate
Meas. Tech.
pH-Based Assay
pH
7.4±n/a
IC50
7.4±0.3 nM
Comments
extracted
Citation
 Tafesse, L TRPV1 antagonists including dihydroxy substituent and uses thereof US Patent  US9365563 Publication Date 6/14/2016 
Target
Name:
Transient receptor potential cation channel subfamily V member 1
Synonyms:
Capsaicin receptor Osm-9-like TRP channel 1 TRPV1_HUMAN Transient receptor potential cation channel subfamily V member 1 (TRPV1) Transient receptor potential cation channel subfamily V member 1(TRPV1) Vanilloid VR1 Vanilloid receptor 1 Vanilloid receptor 1 (VRI/TRPV1)
Type:
Protein
Mol. Mass.:
94960.75
Organism:
Homo sapiens (Human)
Description:
Q8NER1
Residue:
839
  
Inhibitor
Name:
BDBM236090
Synonyms:
US9365563, B1 | US9878991, Compound B1
Type:
Small organic molecule
Emp. Form.:
C20H20ClF4N3O3
Mol. Mass.:
461.838
SMILES:
OC[C@H](O)c1cnc(c(Cl)c1)C1(F)CCN(CC1)C(=O)Nc1ccc(cc1)C(F)(F)F
: