Target
Transient receptor potential cation channel subfamily V member 1
Ligand
BDBM236105
Substrate
Meas. Tech.
pH-Based Assay
pH
7.4±n/a
IC50
8.1±0.7 nM
Comments
extracted
Citation
 Tafesse, L TRPV1 antagonists including dihydroxy substituent and uses thereof US Patent  US9365563 Publication Date 6/14/2016 
Target
Name:
Transient receptor potential cation channel subfamily V member 1
Synonyms:
Capsaicin receptor Osm-9-like TRP channel 1 TRPV1_HUMAN Transient receptor potential cation channel subfamily V member 1 (TRPV1) Transient receptor potential cation channel subfamily V member 1(TRPV1) Vanilloid VR1 Vanilloid receptor 1 Vanilloid receptor 1 (VRI/TRPV1)
Type:
Protein
Mol. Mass.:
94960.75
Organism:
Homo sapiens (Human)
Description:
Q8NER1
Residue:
839
  
Inhibitor
Name:
BDBM236105
Synonyms:
US9365563, Q1 | US9878991, Compound Q1
Type:
Small organic molecule
Emp. Form.:
C20H19ClF3N3O5S
Mol. Mass.:
505.895
SMILES:
OC[C@@H](O)c1cnc(C2=CCN(CC2)C(=O)Nc2ccc(cc2)S(=O)(=O)C(F)(F)F)c(Cl)c1
: