Target
Transient receptor potential cation channel subfamily V member 1
Ligand
BDBM236123
Substrate
Meas. Tech.
pH-Based Assay
pH
7.4±n/a
IC50
18.0±1.0 nM
Comments
extracted
Citation
 Tafesse, L TRPV1 antagonists including dihydroxy substituent and uses thereof US Patent  US9365563 Publication Date 6/14/2016 
Target
Name:
Transient receptor potential cation channel subfamily V member 1
Synonyms:
Capsaicin receptor Osm-9-like TRP channel 1 TRPV1_HUMAN Transient receptor potential cation channel subfamily V member 1 (TRPV1) Transient receptor potential cation channel subfamily V member 1(TRPV1) Vanilloid VR1 Vanilloid receptor 1 Vanilloid receptor 1 (VRI/TRPV1)
Type:
Protein
Mol. Mass.:
94960.75
Organism:
Homo sapiens (Human)
Description:
Q8NER1
Residue:
839
  
Inhibitor
Name:
BDBM236123
Synonyms:
US9365563, I2 | US9878991, Compound I2
Type:
Small organic molecule
Emp. Form.:
C22H23ClF3N3O3
Mol. Mass.:
469.885
SMILES:
CC(C)Oc1ccc(NC(=O)N2CCC(=CC2)c2ncc(CO)cc2Cl)cc1C(F)(F)F
: