Target
Carbonic anhydrase 6
Ligand
BDBM50028970
Substrate
Meas. Tech.
CA Activity Assay
pH
7.4±0
Temperature
298.15±0 K
Ki
9.7e+2±n/a nM
Citation
 Sentürk, MEkinci, DGöksu, SSupuran, CT Effects of dopaminergic compounds on carbonic anhydrase isozymes I, II, and VI. J Enzyme Inhib Med Chem 27:365-9 (2012)  
Target
Name:
Carbonic anhydrase 6
Synonyms:
CA-VI CAH6_HUMAN Carbonic Anhydrase VI Carbonic anhydrase 6 Carbonic anhydrase 6 (CA-VI) Salivary carbonic anhydrase | Secreted carbonic anhydrase
Type:
Enzyme
Mol. Mass.:
35371.40
Organism:
Homo sapiens (Human)
Description:
P23280
Residue:
308
  
Inhibitor
Name:
BDBM50028970
Synonyms:
6-Amino-5,6,7,8-tetrahydro-naphthalene-1,2-diol CHEMBL163912
Type:
Small organic molecule
Emp. Form.:
C10H13NO2
Mol. Mass.:
179.2157
SMILES:
NC1CCc2c(C1)ccc(O)c2O
: