Target
E3 ubiquitin-protein ligase Mdm2
Ligand
BDBM162075
Substrate
Meas. Tech.
Cytoxicity Assay of JeKo1 cell
IC50
>10000±n/a nM
Citation
 Webb, TRLagisetti, C Anticancer compounds US Patent  US9682993 Publication Date 6/20/2017 
Target
Name:
E3 ubiquitin-protein ligase Mdm2
Synonyms:
Double minute 2 protein E3 ubiquitin-protein ligase Mdm2 (p53-binding protein Mdm2) Human Double Minute 2 (HDM2) MDM2-MDMX p53-Binding Protein MDM2 | p53-binding protein
Type:
Oncoprotein
Mol. Mass.:
55196.54
Organism:
Homo sapiens (Human)
Description:
Q00987
Residue:
491
  
Inhibitor
Name:
BDBM162075
Synonyms:
US9682993, Table III
Type:
Small organic molecule
Emp. Form.:
C24H36N2O7
Mol. Mass.:
464.5518
SMILES:
C[C@H](OC(N)=O)\C=C/C(=O)N[C@H]1CO[C@@H](C\C=C(/C)\C=C\[C@@H]2C[C@]3(CO3)CC(C)(C)O2)OC1
: