Target
Gag-Pol polyprotein [489-587,Q496K]
Ligand
BDBM293322
Substrate
Meas. Tech.
Inhibition of HIV Replication
pH
7.55±n/a
EC50
<100±n/a nM
Comments
extracted
Citation
 Kadow, JFNaidu, BNTu, Y Pyridin-3-yl acetic acid derivatives as inhibitors of human immunodeficiency virus replication US Patent  US10106504 Publication Date 10/23/2018 
Target
Name:
Gag-Pol polyprotein [489-587,Q496K]
Synonyms:
HIV-1 Protease Chain A POL_HV1N5 | gag-pol
Type:
Enzyme Subunit
Mol. Mass.:
10823.26
Organism:
Human immunodeficiency virus type 1
Description:
P12497[489-587,Q496K]
Residue:
99
  
Inhibitor
Name:
BDBM293322
Synonyms:
US10106504, Example 59
Type:
Small organic molecule
Emp. Form.:
C35H37FN2O5
Mol. Mass.:
584.6771
SMILES:
Cc1nc(N)c(-c2ccc(OCCc3ccc(F)cc3)cc2)c(-c2ccc3OCCCc3c2)c1[C@H](OC(C)(C)C)C(O)=O
: