Target
Carbonic anhydrase 2
Ligand
BDBM50386170
Substrate
Meas. Tech.
CA Activity Assay
pH
7.4±n/a
Ki
59107±n/a nM
Comments
extracted
Citation
 Balaydin, HTDurdagi, SEkinci, DSentürk, MGöksu, SMenzek, A Inhibition of human carbonic anhydrase isozymes I, II and VI with a series of bisphenol, methoxy and bromophenol compounds. J Enzyme Inhib Med Chem 27:467-75 (2012)  
Target
Name:
Carbonic anhydrase 2
Synonyms:
CA-II CAC Carbonate dehydratase II Carbonic anhydrase 2 (CA-II) Carbonic anhydrase C Carbonic anhydrase II (CA-II) Carbonic anhydrase II (hCA II) | Carbonic anhydrase isoenzyme II (hCA II)
Type:
Enzyme
Mol. Mass.:
29250.71
Organism:
Homo sapiens (Human)
Description:
P00918
Residue:
260
  
Inhibitor
Name:
BDBM50386170
Synonyms:
CHEMBL2016664 | hCA inhibitor, 4
Type:
Small organic molecule
Emp. Form.:
C17H20O4
Mol. Mass.:
288.3383
SMILES:
COc1ccc(Cc2ccc(OC)c(OC)c2)cc1OC
: