Target
Carbonic anhydrase 1
Ligand
BDBM236549
Substrate
Meas. Tech.
hCA Activity Assay
Ki
15±n/a nM
Citation
 Kaya, MBasar, ECakir, ETunca, EBülbül, M Synthesis and characterization of novel dioxoacridine sulfonamide derivatives as new carbonic anhydrase inhibitors. J Enzyme Inhib Med Chem 27:509-14 (2012)  
Target
Name:
Carbonic anhydrase 1
Synonyms:
CA-I CAB Carbonate dehydratase I Carbonic anhydrase 1 (CA I) Carbonic anhydrase 1 (Recombinant CA I) Carbonic anhydrase B Carbonic anhydrase I (CA I) Carbonic anhydrase I (CAI) Carbonic anhydrase isoenzyme I (hCA I) | hCA
Type:
Enzyme
Mol. Mass.:
28873.37
Organism:
Homo sapiens (Human)
Description:
P00915
Residue:
261
  
Inhibitor
Name:
BDBM236549
Synonyms:
4-(9-(2,4-dimethoxyphenyl)-1,8-dioxo-1,2,3,4,5,6,7,8-octahydroacridine-10(9H)-yl) benzenesulfonamide (7)
Type:
Small organic molecule
Emp. Form.:
C27H28N2O6S
Mol. Mass.:
508.586
SMILES:
COc1ccc(C2C3=C(CCCC3=O)N(C3=C2C(=O)CCC3)c2ccc(cc2)S(N)(=O)=O)c(OC)c1
: