Target
Urease subunit alpha
Ligand
BDBM50099857
Substrate
Meas. Tech.
Urease Inhibition Assay
pH
7.4±n/a
Temperature
277.15±n/a K
IC50
4.247e+4± 1.9e+2 nM
Comments
extracted
Citation
 Cui, YMDong, XWChen, WWang, WJLi, YGZhu, HL Synthesis, inhibitory activity and molecular docking studies of two Cu(II) complexes against Helicobacter pylori urease. J Enzyme Inhib Med Chem 27:528-32 (2012)  
Target
Name:
Urease subunit alpha
Synonyms:
Urease
Type:
Enzyme
Mol. Mass.:
Description:
Components:
This complex has 2 components.
Component 1
Name:
Urease subunit alpha
Synonyms:
Type:
Enzyme
Mol. Mass.:
26573.32
Organism:
Helicobacter pylori ATCC43504
Description:
I0ZGT1
Residue:
238
  
Component 2
Name:
Urease
Synonyms:
Urease subunit beta
Type:
Enzyme
Mol. Mass.:
29567.71
Organism:
Helicobacter pylori ATCC43504
Description:
I0ZGT0
Residue:
281
  
Inhibitor
Name:
BDBM50099857
Synonyms:
ACETOHYDROXAMIC ACID (AHA) Acethydroxamsaeure Acetic acid, oxime Cetohyroxamic acid Methylhydroxamic acid N-Acetylhydroxylamine acetohydroxamic acid
Type:
Small organic molecule
Emp. Form.:
C2H5NO2
Mol. Mass.:
75.0666
SMILES:
CC(=O)NO
: