Target
Receptor-type tyrosine-protein kinase FLT3
Ligand
BDBM236557
Substrate
Meas. Tech.
Mobility Shift Assay
pH
7.5±n/a
Temperature
301.15±n/a K
IC50
>10000±n/a nM
Comments
extracted
Citation
 Wu, FShu, C PI3K and/or mTOR inhibitor US Patent  US9365572 Publication Date 6/14/2016 
Target
Name:
Receptor-type tyrosine-protein kinase FLT3
Synonyms:
CD135 FL cytokine receptor FLK2 FLT3 Fetal liver kinase-2 Fms-like tyrosine kinase 3 (Flt-3) STK-1 Stem cell tyrosine kinase 1
Type:
Enzyme
Mol. Mass.:
112888.62
Organism:
Homo sapiens (Human)
Description:
P36888
Residue:
993
  
Inhibitor
Name:
BDBM236557
Synonyms:
US9365572, 5
Type:
Small organic molecule
Emp. Form.:
C22H13F3N6O2
Mol. Mass.:
450.3728
SMILES:
Nc1ccc(cn1)-c1ccc2ncc3c(n(-c4cccc(c4)C(F)(F)F)c(=O)[nH]c3=O)c2n1
: