Target
Tyrosine-protein kinase JAK3
Ligand
BDBM236557
Substrate
Meas. Tech.
Mobility Shift Assay
pH
7.5±n/a
Temperature
301.15±n/a K
IC50
>10000±n/a nM
Comments
extracted
Citation
 Wu, FShu, C PI3K and/or mTOR inhibitor US Patent  US9365572 Publication Date 6/14/2016 
Target
Name:
Tyrosine-protein kinase JAK3
Synonyms:
JAK-3 JAK3_HUMAN Janus kinase 3 (JAK3) L-JAK | Leukocyte janus kinase
Type:
Protein
Mol. Mass.:
125111.08
Organism:
Homo sapiens (Human)
Description:
P52333
Residue:
1124
  
Inhibitor
Name:
BDBM236557
Synonyms:
US9365572, 5
Type:
Small organic molecule
Emp. Form.:
C22H13F3N6O2
Mol. Mass.:
450.3728
SMILES:
Nc1ccc(cn1)-c1ccc2ncc3c(n(-c4cccc(c4)C(F)(F)F)c(=O)[nH]c3=O)c2n1
: