Target
Genome polyprotein [1027-1711]
Ligand
BDBM236562
Substrate
Meas. Tech.
Inhibition Assay
pH
7.5±n/a
Ki
37±n/a nM
Comments
extracted
Citation
 Raboisson, PJDe Kock, HAMcGowan, DCHu, LTahri, AVendeville, SMVan De Vreken, W Macrocyclic inhibitors of hepatitis C virus US Patent  US9365582 Publication Date 6/14/2016 
Target
Name:
Genome polyprotein [1027-1711]
Synonyms:
NS3-NS4A Protease POLG_HCV77
Type:
Mol. Mass.:
72913.15
Organism:
Hepatitis C virus genotype 1a (strain H77) (HCV)
Description:
amino acids 1027 to 1711
Residue:
685
  
Inhibitor
Name:
BDBM236562
Synonyms:
US9365582, 2
Type:
Small organic molecule
Emp. Form.:
C31H39N3O7
Mol. Mass.:
565.6573
SMILES:
CCOc1cc(O[C@@H]2C[C@@H]3[C@@H](C2)C(=O)N(C)CCCC\C=C/[C@@H]2C[C@]2(NC3=O)C(O)=O)c2ccc(OC)c(C)c2n1
: