Target
Beta-secretase 1
Ligand
BDBM236574
Substrate
Meas. Tech.
HTRF FRET Assay
pH
5±n/a
Temperature
303.15±n/a K
Ki
3.5±n/a nM
Comments
extracted
Citation
 Cumming, JNKaelin, Jr., DEScott, JDWu, WBurnett, DA C5, C6 oxacyclic-fused thiazine dioxide compounds as BACE inhibitors, compositions, and their use US Patent  US9365589 Publication Date 6/14/2016 
Target
Name:
Beta-secretase 1
Synonyms:
ASP2 Aspartyl protease 2 BACE1 Beta-secretase (BACE) Beta-secretase 1 (BACE 1) Beta-secretase 1 (BACE1) Beta-site amyloid precursor protein cleaving enzyme 1 Memapsin-2 beta-Secretase (BACE-1) | beta-Secretase (BACE1)
Type:
Protein
Mol. Mass.:
55755.10
Organism:
Homo sapiens (Human)
Description:
P56817
Residue:
501
  
Inhibitor
Name:
BDBM236574
Synonyms:
US9365589, 1a
Type:
Small organic molecule
Emp. Form.:
C20H20F2N4O4S
Mol. Mass.:
450.459
SMILES:
CC1(C)C(=N)N[C@]2(COC[C@H]2S1(=O)=O)c1cc(NC(=O)c2ccc(F)cn2)ccc1F
: