Target
cGMP-specific 3',5'-cyclic phosphodiesterase
Ligand
BDBM236656
Substrate
Meas. Tech.
Fluorescence Polarization Assay
IC50
3300±n/a nM
Citation
 Piazza, GAAbadi, AH Derivatives of celeboxib, use thereof and preparation thereof US Patent  US9388139 Publication Date 7/12/2016 
Target
Name:
cGMP-specific 3',5'-cyclic phosphodiesterase
Synonyms:
3',5'-cyclic phosphodiesterase PDE5 PDE5A_HUMAN Phosphodiesterase 5 (PDE5) Phosphodiesterase 5A (PDE5A) cGMP-specific 3',5'-cyclic phosphodiesterase
Type:
Protein
Mol. Mass.:
99975.83
Organism:
Homo sapiens (Human)
Description:
O76074
Residue:
875
  
Inhibitor
Name:
BDBM236656
Synonyms:
US9388139, 25
Type:
Small organic molecule
Emp. Form.:
C19H21FN2O3S
Mol. Mass.:
376.445
SMILES:
CC(C)(C)C1=NN(C(C1)c1ccc(F)cc1)c1ccc(cc1)S(O)(=O)=O
: