Target
Prostaglandin G/H synthase 2
Ligand
BDBM236650
Substrate
Meas. Tech.
Colorimetric Assay
IC50
>100000±n/a nM
Citation
 Piazza, GAAbadi, AH Derivatives of celeboxib, use thereof and preparation thereof US Patent  US9388139 Publication Date 7/12/2016 
Target
Name:
Prostaglandin G/H synthase 2
Synonyms:
COX2 Cyclooxygenase 2 (COX-2) Cyclooxygenase-2 (COX-2 AA) Cyclooxygenase-2 (COX-2) PGH2_HUMAN PHS II Prostaglandin E synthase/G/H synthase 2 Prostaglandin-endoperoxide synthase 2
Type:
Enzyme
Mol. Mass.:
69003.89
Organism:
Homo sapiens (Human)
Description:
Recombinant Cox-2 provided by Cayman (Cayman Chemical Co.,Ann Arbor, MI).
Residue:
604
  
Inhibitor
Name:
BDBM236650
Synonyms:
US9388139, 19
Type:
Small organic molecule
Emp. Form.:
C20H21FN2O2
Mol. Mass.:
340.3913
SMILES:
CC(C)(C)C1=NN(C(C1)c1cccc(F)c1)c1ccc(cc1)C(O)=O
: