Target
High affinity cGMP-specific 3',5'-cyclic phosphodiesterase 9A
Ligand
BDBM236643
Substrate
BDBM14391
Meas. Tech.
Fluorescence Polarization Assay
IC50
>50000±n/a nM
Citation
 Piazza, GAAbadi, AH Derivatives of celeboxib, use thereof and preparation thereof US Patent  US9388139 Publication Date 7/12/2016 
Target
Name:
High affinity cGMP-specific 3',5'-cyclic phosphodiesterase 9A
Synonyms:
3',5'-cyclic phosphodiesterase PDE9A_HUMAN Phosphodiesterase 9A (PDE9) | Phosphodiesterase 9A (PDE9A)
Type:
Protein
Mol. Mass.:
68488.40
Organism:
Homo sapiens (Human)
Description:
O76083
Residue:
593
  
Inhibitor
Name:
BDBM236643
Synonyms:
US9388139, 12
Type:
Small organic molecule
Emp. Form.:
C20H20Cl2N2O2
Mol. Mass.:
391.291
SMILES:
CC(C)(C)C1=NN(C(C1)c1ccc(Cl)cc1Cl)c1ccc(cc1)C(O)=O
:
Substrate
Name:
BDBM14391
Synonyms:
2-amino-9-[(4aR,6R,7R,7aS)-2,7-dihydroxy-2-oxidotetrahydro-4H-furo[3,2-d][1,3,2]dioxaphosphinin-6-yl]-1,9-dihydro-6H-purin-6-one GUANOSINE-3 ,5 -MONOPHOSPHATE cGMP
Type:
Nucleoside or nucleotide
Emp. Form.:
C10H12N5O7P
Mol. Mass.:
345.2053
SMILES:
Nc1nc2n(cnc2c(=O)[nH]1)[C@@H]1O[C@@H]2COP(O)(=O)O[C@H]2[C@H]1O
: