Target
Dual specificity protein kinase TTK
Ligand
BDBM236692
Substrate
Meas. Tech.
Kinase Assay
pH
7.7±n/a
Temperature
295.15±n/a K
IC50
0.7±n/a nM
Comments
extracted
Citation
 Klar, UKoppitz, MNguyen, DKosemund, DNeuhaus, RSiemeister, G Substituted benzimidazoles US Patent  US9388140 Publication Date 7/12/2016 
Target
Name:
Dual specificity protein kinase TTK
Synonyms:
Dual specificity protein kinase (TTK) MPS1 Monopolar Spindle 1 (MPS1) Monopolar Spindle 1 Kinase (MPS1) TTK | TTK_HUMAN
Type:
Protein
Mol. Mass.:
97086.79
Organism:
Homo sapiens (Human)
Description:
P33981
Residue:
857
  
Inhibitor
Name:
BDBM236692
Synonyms:
US9388140, 33
Type:
Small organic molecule
Emp. Form.:
C28H26F4N4O3
Mol. Mass.:
542.5247
SMILES:
COc1ccc(Oc2cc(NCCC(F)(F)F)c3ncn(-c4ccc(C(=O)NC5CC5)c(C)c4)c3c2)cc1F
: