Target
Dual specificity protein kinase TTK
Ligand
BDBM236713
Substrate
Meas. Tech.
Kinase Assay
pH
7.7±n/a
Temperature
295.15±n/a K
IC50
0.2±n/a nM
Comments
extracted
Citation
 Klar, UKoppitz, MNguyen, DKosemund, DNeuhaus, RSiemeister, G Substituted benzimidazoles US Patent  US9388140 Publication Date 7/12/2016 
Target
Name:
Dual specificity protein kinase TTK
Synonyms:
Dual specificity protein kinase (TTK) MPS1 Monopolar Spindle 1 (MPS1) Monopolar Spindle 1 Kinase (MPS1) TTK | TTK_HUMAN
Type:
Protein
Mol. Mass.:
97086.79
Organism:
Homo sapiens (Human)
Description:
P33981
Residue:
857
  
Inhibitor
Name:
BDBM236713
Synonyms:
US9388140, 54
Type:
Small organic molecule
Emp. Form.:
C27H25F3N4O3
Mol. Mass.:
510.5076
SMILES:
Cc1cc(ccc1C(=O)NC1CC1)-n1cnc2c(NCCC(F)(F)F)cc(Oc3ccccc3O)cc12
: