Target
Dual specificity protein kinase TTK
Ligand
BDBM236777
Substrate
Meas. Tech.
Kinase Assay
pH
7.7±n/a
Temperature
295.15±n/a K
IC50
7.3±n/a nM
Comments
extracted
Citation
 Klar, UKoppitz, MNguyen, DKosemund, DNeuhaus, RSiemeister, G Substituted benzimidazoles US Patent  US9388140 Publication Date 7/12/2016 
Target
Name:
Dual specificity protein kinase TTK
Synonyms:
Dual specificity protein kinase (TTK) MPS1 Monopolar Spindle 1 (MPS1) Monopolar Spindle 1 Kinase (MPS1) TTK | TTK_HUMAN
Type:
Protein
Mol. Mass.:
97086.79
Organism:
Homo sapiens (Human)
Description:
P33981
Residue:
857
  
Inhibitor
Name:
BDBM236777
Synonyms:
US9388140, 115A
Type:
Small organic molecule
Emp. Form.:
C28H29FN4O4
Mol. Mass.:
504.5527
SMILES:
CNC(=O)c1ccc(cc1C)-n1cnc2c(NCC3CCOCC3)cc(Oc3ccc(O)cc3F)cc12
: