Target
Mu-type opioid receptor
Ligand
BDBM236865
Substrate
Meas. Tech.
[35S]GTPγS Functional Assay
pH
7.4±n/a
Temperature
298.15±n/a K
EC50
269.7±48.2 nM
Comments
extracted
Citation
 Kassick, ALockman, JTafesse, L Substituted morphinans and the use thereof US Patent  US9388162 Publication Date 7/12/2016 
Target
Name:
Mu-type opioid receptor
Synonyms:
M-OR-1 MOR-1 MUOR1 Mu opiate receptor OPRM1 hMOP | mu-type opioid receptor isoform MOR-1
Type:
G Protein-Coupled Receptor (GPCR)
Mol. Mass.:
44789.51
Organism:
Homo sapiens (Human)
Description:
P35372
Residue:
400
  
Inhibitor
Name:
BDBM236865
Synonyms:
US9388162, 72
Type:
Small organic molecule
Emp. Form.:
C24H33NO2
Mol. Mass.:
367.5243
SMILES:
COc1ccc2C[C@@H]3[C@@H]4C[C@@H](C(C)C)C(=O)C[C@]4(CCN3CC3CC3)c2c1
: