Target
Kappa-type opioid receptor
Ligand
BDBM236829
Substrate
Meas. Tech.
[35S]GTPγS Functional Assay
pH
7.4±n/a
Temperature
298.15±n/a K
EC50
225.1±20.1 nM
Comments
extracted
Citation
 Kassick, ALockman, JTafesse, L Substituted morphinans and the use thereof US Patent  US9388162 Publication Date 7/12/2016 
Target
Name:
Kappa-type opioid receptor
Synonyms:
K-OR-1 Kappa-opioid receptor (KOR) Kappa-type opioid receptor (KOR) OPIATE Kappa OPRK1 kappa opioid receptor (KOR)
Type:
G Protein-Coupled Receptor (GPCR)
Mol. Mass.:
42648.76
Organism:
Homo sapiens (Human)
Description:
P41145
Residue:
380
  
Inhibitor
Name:
BDBM236829
Synonyms:
US9388162, 48
Type:
Small organic molecule
Emp. Form.:
C30H37NO4
Mol. Mass.:
475.6191
SMILES:
COc1ccc2C[C@H]3N(CC4CC4)CC[C@@]4(CC(=O)[C@@H](CCOCc5ccccc5)C[C@@]34O)c2c1
: