Target
Kappa-type opioid receptor
Ligand
BDBM236833
Substrate
Meas. Tech.
[35S]GTPγS Functional Assay
pH
7.4±n/a
Temperature
298.15±n/a K
EC50
838.8±9.9 nM
Comments
extracted
Citation
 Kassick, ALockman, JTafesse, L Substituted morphinans and the use thereof US Patent  US9388162 Publication Date 7/12/2016 
Target
Name:
Kappa-type opioid receptor
Synonyms:
K-OR-1 Kappa-opioid receptor (KOR) Kappa-type opioid receptor (KOR) OPIATE Kappa OPRK1 kappa opioid receptor (KOR)
Type:
G Protein-Coupled Receptor (GPCR)
Mol. Mass.:
42648.76
Organism:
Homo sapiens (Human)
Description:
P41145
Residue:
380
  
Inhibitor
Name:
BDBM236833
Synonyms:
US9388162, 58
Type:
Small organic molecule
Emp. Form.:
C29H35NO4
Mol. Mass.:
461.5925
SMILES:
OCC[C@H]1C[C@@]2(O)[C@H]3Cc4ccc(OCc5ccccc5)cc4[C@@]2(CCN3CC2CC2)CC1=O
: