Target
Mitogen-activated protein kinase 1 [8-360]
Ligand
BDBM236888
Substrate
Meas. Tech.
Enzymatic Assay
pH
7.3±n/a
IC50
4.6±n/a nM
Comments
extracted
Citation
 Blake, JChen, HChicarelli, MGaudino, JGazzard, LKintz, SMohr, PRobarge, KSchwarz, JZhou, A Serine/threonine kinase inhibitors US Patent  US9388171 Publication Date 7/12/2016 
Target
Name:
Mitogen-activated protein kinase 1 [8-360]
Synonyms:
ERK2 MAPK1 Mitogen Activated Kinase 1 Mitogen-activated protein kinase 1 (aa 8-360) PRKM2
Type:
Mol. Mass.:
40835.09
Organism:
Homo sapiens (Human)
Description:
P28482 aa 8-360
Residue:
353
  
Inhibitor
Name:
BDBM236888
Synonyms:
US9388171, II-37
Type:
Small organic molecule
Emp. Form.:
C27H26FN7O2
Mol. Mass.:
499.5394
SMILES:
COc1ccc(cc1F)[C@H](NC(=O)c1ccc2cnc(Nc3cc(C)nn3C)cc2c1)c1cnn(C)c1
: