Target
Ribosomal protein S6 kinase alpha-1
Ligand
BDBM236883
Substrate
Meas. Tech.
Phosphorylation Assay
Temperature
310.15±n/a K
IC50
476±n/a nM
Comments
extracted
Citation
 Blake, JChen, HChicarelli, MGaudino, JGazzard, LKintz, SMohr, PRobarge, KSchwarz, JZhou, A Serine/threonine kinase inhibitors US Patent  US9388171 Publication Date 7/12/2016 
Target
Name:
Ribosomal protein S6 kinase alpha-1
Synonyms:
90 kDa ribosomal protein S6 kinase 1 MAP kinase-activated protein kinase 1a RPS6KA1 RPS6KA1(Kin.Dom.2 - C-terminal) RSK1 Ribosomal S6 kinase 1 Ribosomal protein S6 kinase alpha 1 Ribosomal protein S6 kinase alpha-1 (RSK1) p90-RSK 1 p90S6K | pp90RSK1
Type:
Serine/threonine-protein kinase
Mol. Mass.:
82736.10
Organism:
Homo sapiens (Human)
Description:
Residue:
735
  
Inhibitor
Name:
BDBM236883
Synonyms:
US9388171, I-30
Type:
Small organic molecule
Emp. Form.:
C22H22ClFN4O2
Mol. Mass.:
428.887
SMILES:
Fc1cc(CCNC(=O)c2ccc3cnc(NC4CCOCC4)cc3n2)ccc1Cl
: