Target
Vascular endothelial growth factor receptor 2
Ligand
BDBM139558
Substrate
Meas. Tech.
VEGFR2 Kinase Assay
pH
7.4±n/a
Temperature
303.15±n/a K
IC50
2130±n/a nM
Comments
extracted
Citation
 Hull, III, CEMalone, TC Method of treating conditiions with kinase inhibitors US Patent  US9388176 Publication Date 7/12/2016 
Target
Name:
Vascular endothelial growth factor receptor 2
Synonyms:
CD_antigen=CD309 Fetal liver kinase 1 (FLK-1) KDR Protein-tyrosine kinase receptor Flk-1 VEGFR-2 VEGFR2 Vascular Endothelial Growth Factor Receptor Kinase 2 Vascular endothelial growth factor receptor 2 (KDR) Vascular endothelial growth factor receptor 2 (VEGFR2) Vascular endothelial growth factor receptor-2 (VEGFR-2)
Type:
Receptor Tyrosine Kinase
Mol. Mass.:
151510.97
Organism:
Homo sapiens (Human)
Description:
P35968
Residue:
1356
  
Inhibitor
Name:
BDBM139558
Synonyms:
US8889870, 18 US9820989, 18
Type:
Small organic molecule
Emp. Form.:
C21H27N5O
Mol. Mass.:
365.472
SMILES:
Nc1ncc2CN(CCc2n1)c1cccc(c1)C(=O)NCC1CCCCC1
: