Target
Platelet-derived growth factor receptor beta
Ligand
BDBM139617
Substrate
Meas. Tech.
PDGFRβ Kinase Assay
pH
7.4±n/a
Temperature
303.15±n/a K
IC50
>1000±n/a nM
Comments
extracted
Citation
 Hull, III, CEMalone, TC Method of treating conditiions with kinase inhibitors US Patent  US9388176 Publication Date 7/12/2016 
Target
Name:
Platelet-derived growth factor receptor beta
Synonyms:
Beta-type platelet-derived growth factor receptor CD140b antigen PDGF Receptor Substrate PDGFR PDGFR-1 PDGFRB PGFRB_HUMAN Platelet-derived growth factor receptor 1 Platelet-derived growth factor receptor beta (PDGFR-beta) Platelet-derived growth factor receptor beta (PDGFRbeta) | VHL/PDGFRB
Type:
Enzyme
Mol. Mass.:
123922.25
Organism:
Homo sapiens (Human)
Description:
P09619
Residue:
1106
  
Inhibitor
Name:
BDBM139617
Synonyms:
US8889870, 165 US9820989, 165
Type:
Small organic molecule
Emp. Form.:
C22H22N4O
Mol. Mass.:
358.4363
SMILES:
Cc1ccc(NC(=O)Nc2ccc(cc2)N2CCc3ccncc3C2)cc1
: