Target
Vascular endothelial growth factor receptor 2
Ligand
BDBM236917
Substrate
Meas. Tech.
VEGFR2 Kinase Assay
pH
7.4±n/a
Temperature
303.15±n/a K
IC50
27±n/a nM
Comments
extracted
Citation
 Hull, III, CEMalone, TC Substituted 1,2,3,4-tetrahydropyrido[3,4-E] pyrrolo[1,2-A]pyrimidines as kinase US Patent  US9388181 Publication Date 7/12/2016 
Target
Name:
Vascular endothelial growth factor receptor 2
Synonyms:
CD_antigen=CD309 Fetal liver kinase 1 (FLK-1) KDR Protein-tyrosine kinase receptor Flk-1 VEGFR-2 VEGFR2 Vascular Endothelial Growth Factor Receptor Kinase 2 Vascular endothelial growth factor receptor 2 (KDR) Vascular endothelial growth factor receptor 2 (VEGFR2) Vascular endothelial growth factor receptor-2 (VEGFR-2)
Type:
Receptor Tyrosine Kinase
Mol. Mass.:
151510.97
Organism:
Homo sapiens (Human)
Description:
P35968
Residue:
1356
  
Inhibitor
Name:
BDBM236917
Synonyms:
US9388181, 12
Type:
Small organic molecule
Emp. Form.:
C23H22N6O
Mol. Mass.:
398.4604
SMILES:
Cc1cccc(NC(=O)Nc2cccc(c2)N2CCc3c(C2)cnc2ccnn32)c1
: